[llvm-testresults] buildbot failure in lab.llvm.org on clang-x86_64-darwin11-nobootstrap-RAincremental

llvmlab-buildmaster at lab.llvm.org llvmlab-buildmaster at lab.llvm.org
Tue Sep 10 21:16:24 PDT 2013


The Buildbot has detected a failed build on builder clang-x86_64-darwin11-nobootstrap-RAincremental while building cfe.
Full details are available at:
 http://lab.llvm.org:8013/builders/clang-x86_64-darwin11-nobootstrap-RAincremental/builds/7029

Buildbot URL: http://lab.llvm.org:8013/

Buildslave for this Build: xserve5

Build Reason: Triggerable(phase1-stage0)
Build Source Stamp: 190486
Blamelist: 

BUILD FAILED: failed run.llvm.tests

sincerely,
 -The Buildbot


================================================================================

CHANGES:


LOGS:
Last 15 lines of 'stdio':
	PASS: LLVM-Unit :: Transforms/Utils/Release+Asserts/UtilsTests/SpecialCaseListTest.Substring (15425 of 15426)
	PASS: LLVM-Unit :: Support/Release+Asserts/SupportTests/ValueHandle.AssertingVH_Asserts (15426 of 15426)
	
	1 warning(s) in tests.
	Testing Time: 266.96s
	********************
	Failing Tests (1):
	    Clang Tools :: clang-modernize/HeaderReplacements/main.cpp
	
	  Expected Passes    : 15320
	  Expected Failures  : 74
	  Unsupported Tests  : 31
	  Unexpected Failures: 1
	make[1]: *** [check-local-all] Error 1
	make: *** [check-all] Error 2

Last 15 lines of 'Clang Tools :: clang-modernize__HeaderReplacements__main.cpp':
	>     ReplacementText: elem
	>   - FilePath:        /Users/buildslave/zorg/buildbot/smooshlab/slave-0.8/build.clang-x86_64-darwin11-nobootstrap-RAincremental/clang-build/tools/clang/tools/extra/test/clang-modernize/HeaderReplacements/Output/SerializeTest/common.h
	11c11
	<     ReplacementText: "(auto & elem : C)"
	---
	>     ReplacementText: '(auto & elem : C)'
	
	--
	Command Output (stderr):
	--
	Parse: /Users/buildslave/zorg/buildbot/smooshlab/slave-0.8/build.clang-x86_64-darwin11-nobootstrap-RAincremental/clang-build/tools/clang/tools/extra/test/clang-modernize/HeaderReplacements/Output/SerializeTest
	
	--
	
	********************

Last 15 lines of 'warnings (1)':
	lit.py: discovery.py:190: warning: test suite 'Extra Tools Unit Tests' contained no tests







More information about the llvm-testresults mailing list