[llvm-testresults] buildbot failure in smooshlab on clang-i386-darwin9

daniel_dunbar at apple.com daniel_dunbar at apple.com
Tue Sep 14 14:15:27 PDT 2010

The Buildbot has detected a new failure of clang-i386-darwin9 on smooshlab.
Full details are available at:

Buildbot URL: http://smooshlab.apple.com:8010/

Buildslave for this Build: smoosh-15.apple.com

Build Reason: 
Build Source Stamp: 113854
Blamelist: bwilson,resistor

BUILD FAILED: failed test-llvm

 -The Buildbot


File: lib/Transforms/Scalar/JumpThreading.cpp
At: Tue 14 Sep 2010 14:04:13
Changed By: resistor
Comments: Remove the option to disable LazyValueInfo in JumpThreading, as it is now
on by default and has received significant testing.

File: lib/Target/ARM/ARMInstrNEON.td
At: Tue 14 Sep 2010 14:04:13
Changed By: bwilson
Comments: Make NEON ld/st pseudo instruction classes take the instruction itinerary as
an argument, so that we can distinguish instructions with the same register
classes but different numbers of registers (e.g., vld3 and vld4).  Fix some
of the non-pseudo NEON ld/st instruction itineraries to reflect the number
of registers loaded or stored, not just the opcode name.

Last 10 lines of 'stdio':
	    LLVM :: Transforms/JumpThreading/2010-08-26-and.ll
	    LLVM :: Transforms/JumpThreading/basic.ll
	    LLVM :: Transforms/JumpThreading/lvi-load.ll
	  Expected Passes    : 4932
	  Expected Failures  : 28
	  Unsupported Tests  : 552
	  Unexpected Failures: 3
	make[1]: *** [check-local-lit] Error 1
	make: *** [check] Error 2

Last 10 lines of 'fail':
	LLVM :: Transforms/JumpThreading/basic.ll
	LLVM :: Transforms/JumpThreading/2010-08-26-and.ll
	LLVM :: Transforms/JumpThreading/lvi-load.ll

Last 10 lines of 'xfail':
	LLVM :: MC/AsmParser/X86/x86_32-mismatched-add.s
	LLVM :: MC/AsmParser/X86/x86_32-bit_cat.s
	LLVM :: MC/AsmParser/X86/x86_32-encoding.s
	LLVM :: MC/AsmParser/directive_lsym.s
	LLVM :: MC/AsmParser/exprs-invalid.s
	LLVM :: Transforms/DeadArgElim/deadexternal.ll
	LLVM :: Transforms/GVN/rle-no-phi-translate.ll
	LLVM :: Transforms/IndVarSimplify/loop_evaluate_6.ll
	LLVM :: Transforms/TailCallElim/nocapture.ll
	LLVM :: Transforms/TailDup/2008-06-11-AvoidDupLoopHeader.ll

Last 10 lines of 'unsupported':
	LLVM :: LLVMC/C++/hello.cpp
	LLVM :: LLVMC/C++/together.cpp
	LLVM :: LLVMC/C/emit-llvm.c
	LLVM :: LLVMC/C/hello.c
	LLVM :: LLVMC/C/include.c
	LLVM :: LLVMC/C/opt-test.c
	LLVM :: LLVMC/C/sink.c
	LLVM :: LLVMC/C/wall.c
	LLVM :: LLVMC/ObjC++/hello.mm
	LLVM :: LLVMC/ObjC/hello.m

Last 10 lines of 'basic.ll':
	/Users/buildslave/zorg/buildbot/smooshlab/slave/build.clang-i386-darwin9/llvm/test/Transforms/JumpThreading/basic.ll:8:10: error: expected string not found in input
	; CHECK: @test1
	<stdin>:1:1: note: scanning from here

Last 10 lines of '2010-08-26-and.ll':
	/Users/buildslave/zorg/buildbot/smooshlab/slave/build.clang-i386-darwin9/llvm/test/Transforms/JumpThreading/2010-08-26-and.ll:36:10: error: expected string not found in input
	; CHECK: switch i32 %conv.i.i
	<stdin>:1:1: note: scanning from here

Last 10 lines of 'lvi-load.ll':
	/Users/buildslave/zorg/buildbot/smooshlab/slave/build.clang-i386-darwin9/llvm/test/Transforms/JumpThreading/lvi-load.ll:16:10: error: expected string not found in input
	; CHECK: Z3fooPN4llvm5ValueE
	<stdin>:1:1: note: scanning from here

More information about the llvm-testresults mailing list