[llvm-testresults] buildbot failure in smooshlab on clang-x86_64-darwin10-selfhost-rel

daniel_dunbar at apple.com daniel_dunbar at apple.com
Wed Dec 15 10:19:59 PST 2010


The Buildbot has detected a new failure of clang-x86_64-darwin10-selfhost-rel on smooshlab.
Full details are available at:
 http://smooshlab.apple.com:8010/builders/clang-x86_64-darwin10-selfhost-rel/builds/7155

Buildbot URL: http://smooshlab.apple.com:8010/

Buildslave for this Build: smoosh-02

Build Reason: 
Build Source Stamp: 121871
Blamelist: stoklund

BUILD FAILED: failed compile

sincerely,
 -The Buildbot


================================================================================

CHANGES:
Files:
 lib/CodeGen/SplitKit.cpp
 lib/CodeGen/SplitKit.h
At: Wed 15 Dec 2010 09:46:40
Changed By: stoklund
Comments: Separate SplitAnalysis::getSplitLoops().

This method returns the set of loops with uses that are candidates for
splitting.Properties: 




Files:
 lib/CodeGen/SplitKit.cpp
 lib/CodeGen/SplitKit.h
At: Wed 15 Dec 2010 09:56:40
Changed By: stoklund
Comments: Detect and enumerate bypass loops.

Bypass loops have the current live range live through, but contain no uses or
defs. Splitting around a bypass loop can free registers for other uses inside
the loop by spilling the split range.Properties: 




LOGS:
Last 10 lines of 'stdio':
	llvm[4]: Building Release+Asserts Archive Library libLLVMARMAsmParser.a
	llvm[4]: Compiling ARMDisassemblerCore.cpp for Release+Asserts build
	llvm[4]: Compiling ARMDisassembler.cpp for Release+Asserts build
	llvm[3]: Building Release+Asserts Archive Library libLLVMipa.a
	make[1]: *** [CodeGen/.makeall] Error 2
	make[1]: *** Waiting for unfinished jobs....
	llvm[4]: Building Release+Asserts Archive Library libLLVMARMDisassembler.a
	llvm[4]: Compiling ARMTargetInfo.cpp for Release+Asserts build
	llvm[4]: Building Release+Asserts Archive Library libLLVMARMInfo.a
	make: *** [all] Error 1




More information about the llvm-testresults mailing list