[LLVMbugs] [Bug 14918] New: llvm and clang build failed on centos 5.8

bugzilla-daemon at llvm.org bugzilla-daemon at llvm.org
Thu Jan 10 22:35:47 PST 2013


             Bug #: 14918
           Summary: llvm and clang build failed on centos 5.8
           Product: new-bugs
           Version: 3.2
          Platform: PC
        OS/Version: Linux
            Status: NEW
          Severity: normal
          Priority: P
         Component: new bugs
        AssignedTo: unassignedbugs at nondot.org
        ReportedBy: hufeng1987 at gmail.com
                CC: llvmbugs at cs.uiuc.edu
    Classification: Unclassified

clang: error: linker command failed with exit code 1 (use -v to see invocation)
make[2]: *** [/usr/data/build/Release+Asserts/bin/FileCheck] Error 1
make[2]: Leaving directory `/usr/data/build/utils/FileCheck'
make[1]: *** [FileCheck/.makeall] Error 2
make[1]: Leaving directory `/usr/data/build/utils'
make: *** [all] Error 1

Configure bugmail: http://llvm.org/bugs/userprefs.cgi?tab=email
------- You are receiving this mail because: -------
You are on the CC list for the bug.

More information about the llvm-bugs mailing list