[cfe-dev] PPC64 build fails

İsmail Dönmez ismail at donmez.ws
Tue Jan 15 01:09:09 PST 2013


For some time (~1 week) openSUSE PPC64 build fails in stage2:

[16837s] llvm[2]: Compiling MachineInstr.cpp for Release build
[16876s] /tmp/MachineInstr-9gNnJs.s: Assembler messages:
[16876s] /tmp/MachineInstr-9gNnJs.s:179: Error: invalid register operand
when updating
[16876s] clang: error: assembler command failed with exit code 1 (use -v to
see invocation)
[16876s] make[2]: ***
Error 1
[16876s] make[2]: Leaving directory
[16876s] make[1]: *** [CodeGen/.makeall] Error 2
[16876s] make[1]: Leaving directory
[16876s] make: *** [all] Error 1
[16877s] error: Bad exit status from /var/tmp/rpm-tmp.mKmiOL (%build)

Note that stage1 clang is the building compiler here.

-------------- next part --------------
An HTML attachment was scrubbed...
URL: <http://lists.llvm.org/pipermail/cfe-dev/attachments/20130115/bd97f9d1/attachment.html>

More information about the cfe-dev mailing list